[paludis-sekrit] [Paludis] #806: paludis 0.42.2 does not build

Paludis trac at pioto.org
Sun Nov 8 18:41:15 UTC 2009


#806: paludis 0.42.2 does not build
-----------------------------+----------------------------------------------
 Reporter:  uzytkownik       |          Owner:        
     Type:  defect           |         Status:  new   
 Priority:  Sometime         |      Milestone:        
Component:  bindings/python  |        Version:  0.42.2
 Keywords:                   |      Blockedby:        
 Blocking:                   |   Distribution:  Gentoo
-----------------------------+----------------------------------------------
 make[5]: Entering directory `/var/tmp/paludis/sys-apps-
 paludis-0.42.2/work/paludis-0.42.2/doc/api/python'
 rm -fr python
 mkdir python
 env \
             LD_LIBRARY_PATH=`echo
 "\`../../../paludis/repositories/e/ebuild/utils/canonicalise
 ../../../paludis/.libs\`: \
             \`../../../paludis/repositories/e/ebuild/utils/canonicalise
 ../../../paludis/util/.libs\`: \
             \`../../../paludis/repositories/e/ebuild/utils/canonicalise
 ../../../paludis/environments/paludis/.libs\`: \
             \`../../../paludis/repositories/e/ebuild/utils/canonicalise
 ../../../paludis/environments/no_config/.libs\`: \
             \`../../../paludis/repositories/e/ebuild/utils/canonicalise
 ../../../paludis/repositories/e/.libs\`: \
             \`../../../paludis/repositories/e/ebuild/utils/canonicalise
 ../../../paludis/repositories/fake/.libs\`: \
             \`../../../paludis/repositories/e/ebuild/utils/canonicalise
 ../../../python/.libs\`" \
             | tr -d ' '` \
             PYTHONPATH="./.libs" \
             epydoc --name Paludis -o python --url http://paludis.pioto.org
 --no-frames --css ./epydoc.css \
                 ../../../python/paludis.so
 +--------------------------------------------------------------------------
 | In /var/tmp/paludis/sys-apps-paludis-0.42.2/work/paludis-0.42.2/python/
 | paludis.so:
 | No documentation available!
 |     Error: Import failed:
 |            AttributeError: 'Boost.Python.StaticProperty' object
 attribute
 |            '__doc__' is read-only
 |
   Error: Nothing left to document!
 make[5]: Leaving directory `/var/tmp/paludis/sys-apps-
 paludis-0.42.2/work/paludis-0.42.2/doc/api/python'
 make[4]: Leaving directory `/var/tmp/paludis/sys-apps-
 paludis-0.42.2/work/paludis-0.42.2/doc/api/python'
 make[3]: Leaving directory `/var/tmp/paludis/sys-apps-
 paludis-0.42.2/work/paludis-0.42.2/doc/api'
 make[5]: *** [python] Error 1
 make[4]: *** [all-recursive] Error 1
 make[3]: *** [all-recursive] Error 1
 make[2]: Leaving directory `/var/tmp/paludis/sys-apps-
 paludis-0.42.2/work/paludis-0.42.2/doc'
 make[1]: Leaving directory `/var/tmp/paludis/sys-apps-
 paludis-0.42.2/work/paludis-0.42.2'
 make[2]: *** [all-recursive] Error 1
 make[1]: *** [all-recursive] Error 1
 make: *** [all] Error 2
 /usr/libexec/paludis/utils/emake: emake returned error 2

-- 
Ticket URL: <http://trac.pioto.org/paludis/ticket/806>
Paludis <http://paludis.pioto.org/>
Paludis, the Other Package Mangler


More information about the paludis-dev mailing list