[Bugs] [Bug 123] New: dev-lang/python-2.5.2-r4 should not contain references to ${WORK} in installed libraries

bugzilla-daemon at exherbo.org bugzilla-daemon at exherbo.org
Tue Oct 14 22:09:43 BST 2008


https://bugs.exherbo.org/show_bug.cgi?id=123

           Summary: dev-lang/python-2.5.2-r4 should not contain references
                    to ${WORK} in installed libraries
           Product: Arbor
           Version: unspecified
          Platform: All
        OS/Version: Linux
            Status: NEW
          Severity: normal
          Priority: P5
         Component: Packages
        AssignedTo: kloeri at exherbo.org
        ReportedBy: zlin at exherbo.org
           Package: dev-lang/python-2.5.2-r4


When compiling kde/kdeutils[python]::kde I get this:

/usr/bin/i686-pc-linux-gnu-g++  -fPIC -march=i686 -pipe -O2  -Wnon-virtual-dtor
-Wno-long-long -ansi -Wundef -Wcast-align -Wchar-subscripts -Wall -W
-Wpointer-arith -Wformat-security -fno-exceptions -fno-check-new -fno-common
-Woverloaded-virtual -fno-threadsafe-statics -fvisibility=hidden
-fvisibility-inlines-hidden -DNDEBUG -DQT_NO_DEBUG -Wl,--enable-new-dtags
-Wl,--fatal-warnings -Wl,--no-undefined -lc  -shared
-Wl,-soname,libsuperkaramba.so.4 -o ../../lib/libsuperkaramba.so.4.1.0
CMakeFiles/superkaramba.dir/superkaramba_automoc.o
CMakeFiles/superkaramba.dir/karamba.o CMakeFiles/superkaramba.dir/mainwidget.o
CMakeFiles/superkaramba.dir/lineparser.o
CMakeFiles/superkaramba.dir/themefile.o
CMakeFiles/superkaramba.dir/themelocale.o
CMakeFiles/superkaramba.dir/taskmanager.o
CMakeFiles/superkaramba.dir/showdesktop.o
CMakeFiles/superkaramba.dir/karambainterface.o
CMakeFiles/superkaramba.dir/karambamanager.o
CMakeFiles/superkaramba.dir/meters/meter.o
CMakeFiles/superkaramba.dir/meters/bar.o
CMakeFiles/superkaramba.dir/meters/textlabel.o
CMakeFiles/superkaramba.dir/meters/imagelabel.o
CMakeFiles/superkaramba.dir/meters/graph.o
CMakeFiles/superkaramba.dir/meters/textfield.o
CMakeFiles/superkaramba.dir/meters/richtextlabel.o
CMakeFiles/superkaramba.dir/meters/input.o
CMakeFiles/superkaramba.dir/meters/clickarea.o
CMakeFiles/superkaramba.dir/meters/clickmap.o
CMakeFiles/superkaramba.dir/sensors/sensor.o
CMakeFiles/superkaramba.dir/sensors/date.o
CMakeFiles/superkaramba.dir/sensors/mem.o
CMakeFiles/superkaramba.dir/sensors/uptime.o
CMakeFiles/superkaramba.dir/sensors/cpu.o
CMakeFiles/superkaramba.dir/sensors/network.o
CMakeFiles/superkaramba.dir/sensors/program.o
CMakeFiles/superkaramba.dir/sensors/disk.o
CMakeFiles/superkaramba.dir/sensors/sensorparams.o
CMakeFiles/superkaramba.dir/sensors/lmsensor.o
CMakeFiles/superkaramba.dir/sensors/textfile.o
CMakeFiles/superkaramba.dir/sensors/rss.o
CMakeFiles/superkaramba.dir/sensors/plasmaengine.o
CMakeFiles/superkaramba.dir/python/karamba.o
CMakeFiles/superkaramba.dir/python/meter.o
CMakeFiles/superkaramba.dir/python/bar.o
CMakeFiles/superkaramba.dir/python/textlabel.o
CMakeFiles/superkaramba.dir/python/imagelabel.o
CMakeFiles/superkaramba.dir/python/graph.o
CMakeFiles/superkaramba.dir/python/richtextlabel.o
CMakeFiles/superkaramba.dir/python/input.o
CMakeFiles/superkaramba.dir/python/misc.o
CMakeFiles/superkaramba.dir/python/svcgrp.o
CMakeFiles/superkaramba.dir/python/menu.o
CMakeFiles/superkaramba.dir/python/systray.o
CMakeFiles/superkaramba.dir/python/widget.o
CMakeFiles/superkaramba.dir/python/task.o
CMakeFiles/superkaramba.dir/python/config.o
CMakeFiles/superkaramba.dir/superkarambasettings.o -L/usr/lib/qt4
-L/usr/lib/python2.5/config -lkdeui -lkdecore /usr/lib/qt4/libQtNetwork.so
/usr/lib/qt4/libQtXml.so /usr/lib/qt4/libQtGui.so -lkio -lkpty -lkdecore
/usr/lib/qt4/libQtScript.so /usr/lib/qt4/libQtXml.so -lkrosscore -lkde3support
-ldl -lplasma -lqimageblitz -lSM -lICE -lX11 -lXext -lXft -lXau -lXdmcp -lXpm
/usr/lib/python2.5/config/libpython2.5.a -lqimageblitz /usr/lib/qt4/libQtSvg.so
-lkio -lkpty /usr/lib/qt4/libQtScript.so /usr/lib/qt4/libQtGui.so -lkdecore
/usr/lib/qt4/libQtDBus.so /usr/lib/qt4/libQtCore.so -lpthread -lkrosscore
-lkde3support -ldl -lplasma -lqimageblitz -lSM -lICE -lX11 -lXext -lXft -lXau
-lXdmcp -lXpm /usr/lib/python2.5/config/libpython2.5.a -lqimageblitz -lSM -lICE
-lX11 -lXext -lXft -lXau -lXdmcp -lXpm /usr/lib/python2.5/config/libpython2.5.a
-Wl,-rpath,/usr/lib/qt4:::::::::
/usr/lib/python2.5/config/libpython2.5.a(posixmodule.o): In function
`posix_forkpty':
/var/tmp/paludis/build/dev-lang-python-2.5.2-r4/work/Python-2.5.2/./Modules/posixmodule.c:3579:
undefined reference to `forkpty'
/usr/lib/python2.5/config/libpython2.5.a(posixmodule.o): In function
`posix_openpty':
/var/tmp/paludis/build/dev-lang-python-2.5.2-r4/work/Python-2.5.2/./Modules/posixmodule.c:3521:
undefined reference to `openpty'
collect2: ld returned 1 exit status
make[2]: *** [lib/libsuperkaramba.so.4.1.0] Error 1
make[2]: Leaving directory
`/var/tmp/paludis/build/kde-kdeutils-4.1.2/work/build'
make[1]: Leaving directory
`/var/tmp/paludis/build/kde-kdeutils-4.1.2/work/build'
make[1]: *** [superkaramba/src/CMakeFiles/superkaramba.dir/all] Error 2
make: *** [all] Error 2

!!! ERROR in kde/kdeutils-4.1.2:
!!! In /usr/libexec/paludis/utils/emake at line 25
!!! emake returned error 2

Which shows that /usr/lib/python2.5/config/libpython2.5.a contains references
to objects in ${WORK}. Grepping through the contents of python shows that the
same applies to:

/usr/lib/python2.5/config/python.o
/usr/lib/python2.5/lib-dynload/pyexpat.so
/usr/lib/python2.5/lib-dynload/_ctypes.so
/usr/lib/python2.5/lib-dynload/array.so

* dev-lang/python::arbor :2.5 [R 2.5.2-r4] <target> -berkdb -examples -gdbm
-ipv6 -ncurses -readline -sqlite -ssl -tk


-- 
Configure bugmail: https://bugs.exherbo.org/userprefs.cgi?tab=email
------- You are receiving this mail because: -------
You are watching all bug changes.



More information about the Bugs mailing list