[paludis-user] contrarius compile error

Trent unnaturalhigh at gmail.com
Fri Aug 24 21:43:24 UTC 2007


It seems that I am still coming across problems with contrarius
(specifically gcc)-although in the current situation, I am facing, a
similar problem as before. This situation occurs on my x86 system when
trying to build a toolchain for a x86_64 system; if further such
information is required such as, bashrc, use.conf or
keywords.conf-please do not hesitate to ask for any aforementioned
information or other pertaining details.

###OUTPUT###
cross-x86_64-pc-linux-gnu/gcc-4.1.2::cross-toolchains
{:x86_64-pc-linux-gnu-4.1} [N] (-altivec) -bootstrap -build d -doc
-fortran -gcj -gtk (-hardened) -ip28 -ip32r10k -mudflap (-multilib)
-multislot (-n32) (-n64) nls nocxx -objc -objc++ -objc-gc -test -vanilla
###END###

###OUTPUT###
x86_64-pc-linux-gnu-ranlib ./libgcc.a
make[3]: Leaving directory
`/var/tmp/paludis/cross-x86_64-pc-linux-gnu/gcc-4.1.2/work/build/gcc'
echo timestamp > stmp-multilib
rm gfortran.pod
make[2]: Leaving directory
`/var/tmp/paludis/cross-x86_64-pc-linux-gnu/gcc-4.1.2/work/build/gcc'
Checking multilib configuration...
/bin/sh
/var/tmp/paludis/cross-x86_64-pc-linux-gnu/gcc-4.1.2/work/gcc-4.1.2/mkinstalldirs
x86_64-pc-linux-gnu/libstdc++-v3 ; \
        rm -f x86_64-pc-linux-gnu/libstdc++-v3/Makefile || : ; \
        cp multilib.out x86_64-pc-linux-gnu/libstdc++-v3/multilib.out
/bin/sh
/var/tmp/paludis/cross-x86_64-pc-linux-gnu/gcc-4.1.2/work/gcc-4.1.2/mkinstalldirs
x86_64-pc-linux-gnu/libiberty ; \
        rm -f x86_64-pc-linux-gnu/libiberty/Makefile || : ; \
        cp multilib.out x86_64-pc-linux-gnu/libiberty/multilib.out
/bin/sh
/var/tmp/paludis/cross-x86_64-pc-linux-gnu/gcc-4.1.2/work/gcc-4.1.2/mkinstalldirs
x86_64-pc-linux-gnu/libmudflap ; \
        rm -f x86_64-pc-linux-gnu/libmudflap/Makefile || : ; \
        cp multilib.out x86_64-pc-linux-gnu/libmudflap/multilib.out
/bin/sh
/var/tmp/paludis/cross-x86_64-pc-linux-gnu/gcc-4.1.2/work/gcc-4.1.2/mkinstalldirs
x86_64-pc-linux-gnu/libgfortran ; \
        rm -f x86_64-pc-linux-gnu/libgfortran/Makefile || : ; \
        cp multilib.out x86_64-pc-linux-gnu/libgfortran/multilib.out
mkdir -p -- x86_64-pc-linux-gnu/libstdc++-v3
/bin/sh
/var/tmp/paludis/cross-x86_64-pc-linux-gnu/gcc-4.1.2/work/gcc-4.1.2/mkinstalldirs
x86_64-pc-linux-gnu/libobjc ; \
        rm -f x86_64-pc-linux-gnu/libobjc/Makefile || : ; \
        cp multilib.out x86_64-pc-linux-gnu/libobjc/multilib.out
mkdir -p -- x86_64-pc-linux-gnu/libiberty
mkdir -p -- x86_64-pc-linux-gnu/libmudflap
/bin/sh
/var/tmp/paludis/cross-x86_64-pc-linux-gnu/gcc-4.1.2/work/gcc-4.1.2/mkinstalldirs
x86_64-pc-linux-gnu/libphobos ; \
        rm -f x86_64-pc-linux-gnu/libphobos/Makefile || : ; \
        cp multilib.out x86_64-pc-linux-gnu/libphobos/multilib.out
mkdir -p -- x86_64-pc-linux-gnu/libgfortran
mkdir -p -- x86_64-pc-linux-gnu/libobjc
mkdir -p -- x86_64-pc-linux-gnu/libphobos
Configuring in x86_64-pc-linux-gnu/libiberty
Configuring in x86_64-pc-linux-gnu/libgfortran
Configuring in x86_64-pc-linux-gnu/libmudflap
Configuring in x86_64-pc-linux-gnu/libstdc++-v3
configure: creating cache ./config.cache
configure: creating cache ./config.cache
configure: creating cache ./config.cache
checking build system type... checking whether to enable
maintainer-specific portions of Makefiles... no
checking for makeinfo... makeinfo --split-size=5000000
checking build system type... configure: creating cache ./config.cache
i686-pc-linux-gnu
checking for perl... perl
checking build system type... i686-pc-linux-gnu
checking for --enable-version-specific-runtime-libs... no
checking host system type... checking host system type... checking build
system type... i686-pc-linux-gnu
i686-pc-linux-gnu
x86_64-pc-linux-gnu
x86_64-pc-linux-gnu
checking host system type... checking host system type...
x86_64-pc-linux-gnu
x86_64-pc-linux-gnu
checking target system type... checking target system type... checking
for x86_64-pc-linux-gnu-ar... x86_64-pc-linux-gnu-ar
checking for x86_64-pc-linux-gnu-ranlib... x86_64-pc-linux-gnu-ranlib
checking for x86_64-pc-linux-gnu-gcc...
/var/tmp/paludis/cross-x86_64-pc-linux-gnu/gcc-4.1.2/work/build/./gcc/xgcc
-B/var/tmp/paludis/cross-x86_64-pc-linux-gnu/gcc-4.1.2/work/build/./gcc/
-B/usr/x86_64-pc-linux-gnu/bin/ -B/usr/x86_64-pc-linux-gnu/lib/ -isystem
/usr/x86_64-pc-linux-gnu/include -isystem
/usr/x86_64-pc-linux-gnu/sys-include
x86_64-pc-linux-gnu
checking target system type... x86_64-pc-linux-gnu
x86_64-pc-linux-gnu
checking for a BSD-compatible install... /usr/bin/install -c
checking whether build environment is sane... checking for a
BSD-compatible install... /usr/bin/install -c
checking whether build environment is sane... checking for a
BSD-compatible install... /usr/bin/install -c
checking whether build environment is sane... checking for suffix of
object files... o
checking whether we are using the GNU C compiler... yes
yes
yes
checking for gawk... gawk
checking whether make sets $(MAKE)... yes
checking whether
/var/tmp/paludis/cross-x86_64-pc-linux-gnu/gcc-4.1.2/work/build/./gcc/xgcc
-B/var/tmp/paludis/cross-x86_64-pc-linux-gnu/gcc-4.1.2/work/build/./gcc/
-B/usr/x86_64-pc-linux-gnu/bin/ -B/usr/x86_64-pc-linux-gnu/lib/ -isystem
/usr/x86_64-pc-linux-gnu/include -isystem
/usr/x86_64-pc-linux-gnu/sys-include accepts -g... checking for gawk... gawk
checking whether make sets $(MAKE)... checking for gawk... gawk
checking whether make sets $(MAKE)... yes
yes
checking for x86_64-pc-linux-gnu-strip... x86_64-pc-linux-gnu-strip
checking whether to enable maintainer-specific portions of Makefiles... no
checking for x86_64-pc-linux-gnu-strip... x86_64-pc-linux-gnu-strip
checking for x86_64-pc-linux-gnu-gcc...
/var/tmp/paludis/cross-x86_64-pc-linux-gnu/gcc-4.1.2/work/build/./gcc/xgcc
-B/var/tmp/paludis/cross-x86_64-pc-linux-gnu/gcc-4.1.2/work/build/./gcc/
-B/usr/x86_64-pc-linux-gnu/bin/ -B/usr/x86_64-pc-linux-gnu/lib/ -isystem
/usr/x86_64-pc-linux-gnu/include -isystem
/usr/x86_64-pc-linux-gnu/sys-include
checking for x86_64-pc-linux-gnu-gcc...
/var/tmp/paludis/cross-x86_64-pc-linux-gnu/gcc-4.1.2/work/build/./gcc/xgcc
-B/var/tmp/paludis/cross-x86_64-pc-linux-gnu/gcc-4.1.2/work/build/./gcc/
-B/usr/x86_64-pc-linux-gnu/bin/ -B/usr/x86_64-pc-linux-gnu/lib/ -isystem
/usr/x86_64-pc-linux-gnu/include -isystem
/usr/x86_64-pc-linux-gnu/sys-include
yes
checking for x86_64-pc-linux-gnu-strip... x86_64-pc-linux-gnu-strip
checking for --enable-version-specific-runtime-libs... no
checking whether to enable maintainer-specific portions of Makefiles... no
checking for x86_64-pc-linux-gnu-gcc...
/var/tmp/paludis/cross-x86_64-pc-linux-gnu/gcc-4.1.2/work/build/./gcc/xgcc
-B/var/tmp/paludis/cross-x86_64-pc-linux-gnu/gcc-4.1.2/work/build/./gcc/
-B/usr/x86_64-pc-linux-gnu/bin/ -B/usr/x86_64-pc-linux-gnu/lib/ -isystem
/usr/x86_64-pc-linux-gnu/include -isystem
/usr/x86_64-pc-linux-gnu/sys-include
yes
checking for
/var/tmp/paludis/cross-x86_64-pc-linux-gnu/gcc-4.1.2/work/build/./gcc/xgcc
-B/var/tmp/paludis/cross-x86_64-pc-linux-gnu/gcc-4.1.2/work/build/./gcc/
-B/usr/x86_64-pc-linux-gnu/bin/ -B/usr/x86_64-pc-linux-gnu/lib/ -isystem
/usr/x86_64-pc-linux-gnu/include -isystem
/usr/x86_64-pc-linux-gnu/sys-include option to accept ANSI C... checking
for C compiler default output file name... checking for suffix of object
files... configure: error: C compiler cannot create executables
See `config.log' for more details.
checking for suffix of object files... o
checking whether we are using the GNU C compiler... o
checking whether we are using the GNU C compiler... yes
checking whether
/var/tmp/paludis/cross-x86_64-pc-linux-gnu/gcc-4.1.2/work/build/./gcc/xgcc
-B/var/tmp/paludis/cross-x86_64-pc-linux-gnu/gcc-4.1.2/work/build/./gcc/
-B/usr/x86_64-pc-linux-gnu/bin/ -B/usr/x86_64-pc-linux-gnu/lib/ -isystem
/usr/x86_64-pc-linux-gnu/include -isystem
/usr/x86_64-pc-linux-gnu/sys-include accepts -g... yes
checking whether
/var/tmp/paludis/cross-x86_64-pc-linux-gnu/gcc-4.1.2/work/build/./gcc/xgcc
-B/var/tmp/paludis/cross-x86_64-pc-linux-gnu/gcc-4.1.2/work/build/./gcc/
-B/usr/x86_64-pc-linux-gnu/bin/ -B/usr/x86_64-pc-linux-gnu/lib/ -isystem
/usr/x86_64-pc-linux-gnu/include -isystem
/usr/x86_64-pc-linux-gnu/sys-include accepts -g... yes
checking for
/var/tmp/paludis/cross-x86_64-pc-linux-gnu/gcc-4.1.2/work/build/./gcc/xgcc
-B/var/tmp/paludis/cross-x86_64-pc-linux-gnu/gcc-4.1.2/work/build/./gcc/
-B/usr/x86_64-pc-linux-gnu/bin/ -B/usr/x86_64-pc-linux-gnu/lib/ -isystem
/usr/x86_64-pc-linux-gnu/include -isystem
/usr/x86_64-pc-linux-gnu/sys-include option to accept ANSI C... yes
checking for
/var/tmp/paludis/cross-x86_64-pc-linux-gnu/gcc-4.1.2/work/build/./gcc/xgcc
-B/var/tmp/paludis/cross-x86_64-pc-linux-gnu/gcc-4.1.2/work/build/./gcc/
-B/usr/x86_64-pc-linux-gnu/bin/ -B/usr/x86_64-pc-linux-gnu/lib/ -isystem
/usr/x86_64-pc-linux-gnu/include -isystem
/usr/x86_64-pc-linux-gnu/sys-include option to accept ANSI C... make[1]:
*** [configure-target-libmudflap] Error 1
make[1]: *** Waiting for unfinished jobs....
none needed
checking how to run the C preprocessor...
/var/tmp/paludis/cross-x86_64-pc-linux-gnu/gcc-4.1.2/work/build/./gcc/xgcc
-B/var/tmp/paludis/cross-x86_64-pc-linux-gnu/gcc-4.1.2/work/build/./gcc/
-B/usr/x86_64-pc-linux-gnu/bin/ -B/usr/x86_64-pc-linux-gnu/lib/ -isystem
/usr/x86_64-pc-linux-gnu/include -isystem
/usr/x86_64-pc-linux-gnu/sys-include -E
none needed
none needed
checking for x86_64-pc-linux-gnu-g++... 
/var/tmp/paludis/cross-x86_64-pc-linux-gnu/gcc-4.1.2/work/build/./gcc/xgcc
-shared-libgcc
-B/var/tmp/paludis/cross-x86_64-pc-linux-gnu/gcc-4.1.2/work/build/./gcc
-nostdinc++
-L/var/tmp/paludis/cross-x86_64-pc-linux-gnu/gcc-4.1.2/work/build/x86_64-pc-linux-gnu/libstdc++-v3/src
-L/var/tmp/paludis/cross-x86_64-pc-linux-gnu/gcc-4.1.2/work/build/x86_64-pc-linux-gnu/libstdc++-v3/src/.libs
-B/usr/x86_64-pc-linux-gnu/bin/ -B/usr/x86_64-pc-linux-gnu/lib/ -isystem
/usr/x86_64-pc-linux-gnu/include -isystem
/usr/x86_64-pc-linux-gnu/sys-include
checking whether
/var/tmp/paludis/cross-x86_64-pc-linux-gnu/gcc-4.1.2/work/build/./gcc/xgcc
-B/var/tmp/paludis/cross-x86_64-pc-linux-gnu/gcc-4.1.2/work/build/./gcc/
-B/usr/x86_64-pc-linux-gnu/bin/ -B/usr/x86_64-pc-linux-gnu/lib/ -isystem
/usr/x86_64-pc-linux-gnu/include -isystem
/usr/x86_64-pc-linux-gnu/sys-include and cc understand -c and -o
together... checking for x86_64-pc-linux-gnu-as...
/var/tmp/paludis/cross-x86_64-pc-linux-gnu/gcc-4.1.2/work/build/./gcc/as
checking for x86_64-pc-linux-gnu-ar... x86_64-pc-linux-gnu-ar
checking for x86_64-pc-linux-gnu-ranlib... x86_64-pc-linux-gnu-ranlib
checking whether make sets $(MAKE)... (cached) yes
checking for a BSD-compatible install... /usr/bin/install -c
checking for ld used by GCC... checking whether we are using the GNU C++
compiler...
/var/tmp/paludis/cross-x86_64-pc-linux-gnu/gcc-4.1.2/work/build/./gcc/collect-ld
checking if the linker
(/var/tmp/paludis/cross-x86_64-pc-linux-gnu/gcc-4.1.2/work/build/./gcc/collect-ld)
is GNU ld... yes
checking for
/var/tmp/paludis/cross-x86_64-pc-linux-gnu/gcc-4.1.2/work/build/./gcc/collect-ld
option to reload object files... -r
checking for BSD-compatible nm...
/var/tmp/paludis/cross-x86_64-pc-linux-gnu/gcc-4.1.2/work/build/./gcc/nm
checking whether ln -s works... yes
checking how to recognise dependant libraries... pass_all
checking the maximum length of command line arguments... none
checking for x86_64-pc-linux-gnu-ranlib... (cached)
x86_64-pc-linux-gnu-ranlib
checking for x86_64-pc-linux-gnu-strip... (cached) x86_64-pc-linux-gnu-strip
yes
checking whether 
/var/tmp/paludis/cross-x86_64-pc-linux-gnu/gcc-4.1.2/work/build/./gcc/xgcc
-shared-libgcc
-B/var/tmp/paludis/cross-x86_64-pc-linux-gnu/gcc-4.1.2/work/build/./gcc
-nostdinc++
-L/var/tmp/paludis/cross-x86_64-pc-linux-gnu/gcc-4.1.2/work/build/x86_64-pc-linux-gnu/libstdc++-v3/src
-L/var/tmp/paludis/cross-x86_64-pc-linux-gnu/gcc-4.1.2/work/build/x86_64-pc-linux-gnu/libstdc++-v3/src/.libs
-B/usr/x86_64-pc-linux-gnu/bin/ -B/usr/x86_64-pc-linux-gnu/lib/ -isystem
/usr/x86_64-pc-linux-gnu/include -isystem
/usr/x86_64-pc-linux-gnu/sys-include accepts -g... updating cache
./config.cache
yes
checking for an ANSI C-conforming const... yes
yes
checking for inline... loading cache ./config.cache within ltconfig
inline
checking whether byte ordering is bigendian... checking for objdir... .libs
checking for
/var/tmp/paludis/cross-x86_64-pc-linux-gnu/gcc-4.1.2/work/build/./gcc/xgcc
option to produce PIC... -fPIC -DPIC
checking if
/var/tmp/paludis/cross-x86_64-pc-linux-gnu/gcc-4.1.2/work/build/./gcc/xgcc
PIC flag -fPIC -DPIC works... yes
checking if
/var/tmp/paludis/cross-x86_64-pc-linux-gnu/gcc-4.1.2/work/build/./gcc/xgcc
static flag -static works... no
checking for a BSD-compatible install... /usr/bin/install -c
no
finding the maximum length of command line arguments... checking for
sys/file.h... no
checking for sys/param.h... checking whether ln -s works... yes
checking for x86_64-pc-linux-gnu-as...
/var/tmp/paludis/cross-x86_64-pc-linux-gnu/gcc-4.1.2/work/build/./gcc/as
checking for x86_64-pc-linux-gnu-ar... x86_64-pc-linux-gnu-ar
checking for x86_64-pc-linux-gnu-ranlib... x86_64-pc-linux-gnu-ranlib
checking whether to enable maintainer-specific portions of Makefiles... no
configure: CPU config directory is cpu/i486
configure: OS config directory is os/gnu-linux
checking for ld used by GCC... no
checking for limits.h...
/var/tmp/paludis/cross-x86_64-pc-linux-gnu/gcc-4.1.2/work/build/./gcc/collect-ld
checking if the linker
(/var/tmp/paludis/cross-x86_64-pc-linux-gnu/gcc-4.1.2/work/build/./gcc/collect-ld)
is GNU ld... yes
checking for
/var/tmp/paludis/cross-x86_64-pc-linux-gnu/gcc-4.1.2/work/build/./gcc/collect-ld
option to reload object files... -r
checking for BSD-compatible nm...
/var/tmp/paludis/cross-x86_64-pc-linux-gnu/gcc-4.1.2/work/build/./gcc/nm
checking how to recognise dependant libraries... pass_all
checking the maximum length of command line arguments... none
checking for x86_64-pc-linux-gnu-ranlib... (cached)
x86_64-pc-linux-gnu-ranlib
checking for x86_64-pc-linux-gnu-strip... (cached) x86_64-pc-linux-gnu-strip
yes
updating cache ./config.cache
checking for stdlib.h... no
checking for malloc.h... loading cache ./config.cache within ltconfig
no
checking for string.h... 49153
checking if
/var/tmp/paludis/cross-x86_64-pc-linux-gnu/gcc-4.1.2/work/build/./gcc/xgcc
supports -c -o file.o... checking for objdir... .libs
checking for
/var/tmp/paludis/cross-x86_64-pc-linux-gnu/gcc-4.1.2/work/build/./gcc/xgcc
option to produce PIC... -fPIC -DPIC
checking if
/var/tmp/paludis/cross-x86_64-pc-linux-gnu/gcc-4.1.2/work/build/./gcc/xgcc
PIC flag -fPIC -DPIC works... no
yes
checking if
/var/tmp/paludis/cross-x86_64-pc-linux-gnu/gcc-4.1.2/work/build/./gcc/xgcc
supports -fno-rtti -fno-exceptions ... checking for unistd.h... yes
checking if
/var/tmp/paludis/cross-x86_64-pc-linux-gnu/gcc-4.1.2/work/build/./gcc/xgcc
static flag -static works... no
checking whether the linker
(/var/tmp/paludis/cross-x86_64-pc-linux-gnu/gcc-4.1.2/work/build/./gcc/collect-ld
-m elf_x86_64) supports shared libraries... yes
checking how to hardcode library paths into programs... immediate
checking whether stripping libraries is possible... no
finding the maximum length of command line arguments... yes
checking dynamic linker characteristics... GNU/Linux ld.so
checking command to parse
/var/tmp/paludis/cross-x86_64-pc-linux-gnu/gcc-4.1.2/work/build/./gcc/nm
output... no
checking for strings.h... no
checking for sys/time.h... failed
checking if libtool supports shared libraries... yes
checking whether to build shared libraries... no
checking whether to build static libraries... yes
no
checking for time.h... no
checking for sys/resource.h... no
checking for sys/stat.h... no
checking for sys/mman.h... 49153
checking if
/var/tmp/paludis/cross-x86_64-pc-linux-gnu/gcc-4.1.2/work/build/./gcc/xgcc
supports -c -o file.o... no
checking for fcntl.h... yes
checking if
/var/tmp/paludis/cross-x86_64-pc-linux-gnu/gcc-4.1.2/work/build/./gcc/xgcc
supports -fno-rtti -fno-exceptions ... no
checking whether the linker
(/var/tmp/paludis/cross-x86_64-pc-linux-gnu/gcc-4.1.2/work/build/./gcc/collect-ld
-m elf_x86_64) supports shared libraries... yes
checking how to hardcode library paths into programs... immediate
checking whether stripping libraries is possible... no
yes
checking dynamic linker characteristics... GNU/Linux ld.so
checking command to parse
/var/tmp/paludis/cross-x86_64-pc-linux-gnu/gcc-4.1.2/work/build/./gcc/nm
output... checking for alloca.h... no
checking for sys/pstat.h... no
checking for sys/sysmp.h... failed
checking if libtool supports shared libraries... yes
checking whether to build shared libraries... no
checking whether to build static libraries... yes
no
checking for sys/sysinfo.h... no
checking for machine/hal_sysinfo.h... no
checking for sys/table.h... no
checking for sys/sysctl.h... no
creating libtool
checking for sys/systemcfg.h... no
checking for stdint.h... no
checking for stdio_ext.h... updating cache ./config.cache
configure: loading cache ./config.cache
checking for x86_64-pc-linux-gnu-gfortran...
/var/tmp/paludis/cross-x86_64-pc-linux-gnu/gcc-4.1.2/work/build/./gcc/gfortran
-B/var/tmp/paludis/cross-x86_64-pc-linux-gnu/gcc-4.1.2/work/build/./gcc/
-B/usr/x86_64-pc-linux-gnu/bin/ -B/usr/x86_64-pc-linux-gnu/lib/ -isystem
/usr/x86_64-pc-linux-gnu/include -isystem
/usr/x86_64-pc-linux-gnu/sys-include
no
checking for sys/wait.h that is POSIX.1 compatible... checking whether
we are using the GNU Fortran compiler... no
checking whether time.h and sys/time.h may both be included... yes
checking whether
/var/tmp/paludis/cross-x86_64-pc-linux-gnu/gcc-4.1.2/work/build/./gcc/gfortran
-B/var/tmp/paludis/cross-x86_64-pc-linux-gnu/gcc-4.1.2/work/build/./gcc/
-B/usr/x86_64-pc-linux-gnu/bin/ -B/usr/x86_64-pc-linux-gnu/lib/ -isystem
/usr/x86_64-pc-linux-gnu/include -isystem
/usr/x86_64-pc-linux-gnu/sys-include accepts -g... no
checking whether errno must be declared... yes
checking for special C compiler options needed for large files... no
checking for _FILE_OFFSET_BITS value needed for large files... yes
checking for egrep... grep -E
checking for ANSI C header files... no
checking for sys/types.h... no
checking for _LARGE_FILES value needed for large files... no
creating libtool
checking for sys/stat.h... (cached) no
checking for stdlib.h... (cached) no
checking for string.h... (cached) no
no
checking for off_t... checking for memory.h... updating cache ./config.cache
configure: loading cache ./config.cache
checking how to run the C++ preprocessor... no
checking for ANSI C header files... no
checking for strings.h... (cached) no
no
checking for inttypes.h... checking stdlib.h usability... 
/var/tmp/paludis/cross-x86_64-pc-linux-gnu/gcc-4.1.2/work/build/./gcc/xgcc
-shared-libgcc
-B/var/tmp/paludis/cross-x86_64-pc-linux-gnu/gcc-4.1.2/work/build/./gcc
-nostdinc++
-L/var/tmp/paludis/cross-x86_64-pc-linux-gnu/gcc-4.1.2/work/build/x86_64-pc-linux-gnu/libstdc++-v3/src
-L/var/tmp/paludis/cross-x86_64-pc-linux-gnu/gcc-4.1.2/work/build/x86_64-pc-linux-gnu/libstdc++-v3/src/.libs
-B/usr/x86_64-pc-linux-gnu/bin/ -B/usr/x86_64-pc-linux-gnu/lib/ -isystem
/usr/x86_64-pc-linux-gnu/include -isystem
/usr/x86_64-pc-linux-gnu/sys-include -E
no
checking stdlib.h presence... no
checking for stdint.h... (cached) no
no
checking for stdlib.h... checking for unistd.h... (cached) no
checking for int... no
checking stdio.h usability... no
checking size of int... no
checking stdio.h presence... 0
checking for uintptr_t... no
checking for stdio.h... no
no
checking for a 64-bit type... checking string.h usability... loading
cache ./config.cache within ltconfig
checking host system type... no
checking string.h presence... no
checking for string.h... x86_64-pc-linux-gnu
checking build system type... unsigned long
checking for pid_t... no
checking stddef.h usability... i686-pc-linux-gnu
no
no
checking stddef.h presence... checking for library containing
strerror... configure: error: Link tests are not allowed after
GCC_NO_EXECUTABLES.
no
checking for stddef.h... no
checking math.h usability... no
checking math.h presence... no
checking for math.h... checking for objdir... .libs
checking for
/var/tmp/paludis/cross-x86_64-pc-linux-gnu/gcc-4.1.2/work/build/./gcc/xgcc
option to produce PIC... -fPIC -DPIC
checking if
/var/tmp/paludis/cross-x86_64-pc-linux-gnu/gcc-4.1.2/work/build/./gcc/xgcc
PIC flag -fPIC -DPIC works... no
make[1]: *** [configure-target-libiberty] Error 1
checking unistd.h usability... yes
checking if
/var/tmp/paludis/cross-x86_64-pc-linux-gnu/gcc-4.1.2/work/build/./gcc/xgcc
static flag -static works... no
checking unistd.h presence... no
finding the maximum length of command line arguments... (cached) 49153
checking if
/var/tmp/paludis/cross-x86_64-pc-linux-gnu/gcc-4.1.2/work/build/./gcc/xgcc
supports -c -o file.o... (cached) yes
checking if
/var/tmp/paludis/cross-x86_64-pc-linux-gnu/gcc-4.1.2/work/build/./gcc/xgcc
supports -fno-rtti -fno-exceptions ... no
checking for unistd.h... no
checking signal.h usability... yes
checking whether the linker
(/var/tmp/paludis/cross-x86_64-pc-linux-gnu/gcc-4.1.2/work/build/./gcc/collect-ld
-m elf_x86_64) supports shared libraries...
checking how to hardcode library paths into programs... immediate
checking whether stripping libraries is possible... yes
checking dynamic linker characteristics... GNU/Linux ld.so
checking command to parse
/var/tmp/paludis/cross-x86_64-pc-linux-gnu/gcc-4.1.2/work/build/./gcc/nm
output... no
checking signal.h presence... no
checking for signal.h... no
checking time.h usability... no
checking time.h presence... failed
checking if libtool supports shared libraries... yes
checking whether to build shared libraries... no
checking whether to build static libraries... yes
no
checking for time.h... no
checking sys/params.h usability... no
checking sys/params.h presence... no
checking for sys/params.h... no
checking sys/time.h usability... no
checking sys/time.h presence... no
checking for sys/time.h... no
checking sys/times.h usability... no
checking sys/times.h presence... no
checking for sys/times.h... no
checking sys/resource.h usability... no
checking sys/resource.h presence... no
checking for sys/resource.h... no
checking sys/types.h usability... no
checking sys/types.h presence... no
checking for sys/types.h... no
checking sys/stat.h usability... no
checking sys/stat.h presence... no
checking for sys/stat.h... no
checking floatingpoint.h usability... no
checking floatingpoint.h presence... no
checking for floatingpoint.h... no
checking ieeefp.h usability... no
checking ieeefp.h presence... no
checking for ieeefp.h... no
checking fenv.h usability... no
checking fenv.h presence... no
checking for fenv.h... no
appending configuration tag "CXX" to libtool
checking fptrap.h usability... checking for exception model to use...
call frame
checking for compiler with PCH support... no
checking fptrap.h presence... no
checking for enabled PCH... no
checking for underlying I/O to use... stdio
checking how to run the C preprocessor... no
checking for fptrap.h... no
checking float.h usability... no
checking float.h presence... no
checking for float.h... no
checking complex.h usability...
/var/tmp/paludis/cross-x86_64-pc-linux-gnu/gcc-4.1.2/work/build/./gcc/xgcc
-B/var/tmp/paludis/cross-x86_64-pc-linux-gnu/gcc-4.1.2/work/build/./gcc/
-B/usr/x86_64-pc-linux-gnu/bin/ -B/usr/x86_64-pc-linux-gnu/lib/ -isystem
/usr/x86_64-pc-linux-gnu/include -isystem
/usr/x86_64-pc-linux-gnu/sys-include -E
no
checking complex.h presence... no
checking for complex.h... no
looking for a compliant stdint.h in stdint.h, checking for uintmax_t...
checking for egrep... grep -E
checking for ANSI C header files... no
looking for a compliant stdint.h in inttypes.h, checking for uintmax_t... no
checking for sys/types.h... no
looking for a compliant stdint.h in sys/inttypes.h, checking for
uintmax_t... no
no
looking for an incomplete stdint.h in stdint.h, checking for uint32_t...
checking for sys/stat.h... no
looking for an incomplete stdint.h in inttypes.h, checking for
uint32_t... no
checking for stdlib.h... no
looking for an incomplete stdint.h in sys/inttypes.h, checking for
uint32_t... no
no
looking for u_intXX_t types in sys/types.h, checking for u_int32_t...
checking for string.h... no
checking for memory.h... no
looking for u_intXX_t types in inttypes.h, checking for u_int32_t... no
looking for u_intXX_t types in sys/inttypes.h, checking for u_int32_t... no
no
checking what to include in gstdint.h... checking for strings.h...
stddef.h (using manual detection)
checking for void *... no
checking for inttypes.h... no
checking size of void *... 0
checking for long... no
checking size of long... 0
checking for int... no
checking for stdint.h... no
checking size of int... 0
checking for short... no
checking for unistd.h... no
checking size of short... 0
checking for char... no
checking size of char... 0
checking for type equivalent to int8_t... configure: error: no 8-bit type
/var/tmp/paludis/cross-x86_64-pc-linux-gnu/gcc-4.1.2/work/gcc-4.1.2/libgfortran/configure:
line 9723: exit: please: numeric argument required
/var/tmp/paludis/cross-x86_64-pc-linux-gnu/gcc-4.1.2/work/gcc-4.1.2/libgfortran/configure:
line 9723: exit: please: numeric argument required
no
checking for C locale to use... gnu
checking for msgfmt... yes
checking libintl.h usability... no
checking libintl.h presence... no
checking for libintl.h... no
checking for library containing gettext... configure: error: Link tests
are not allowed after GCC_NO_EXECUTABLES.
make[1]: *** [configure-target-libgfortran] Error 1
make[1]: *** [configure-target-libstdc++-v3] Error 1
make[1]: Leaving directory
`/var/tmp/paludis/cross-x86_64-pc-linux-gnu/gcc-4.1.2/work/build'
make: *** [all] Error 2

!!! ERROR in cross-x86_64-pc-linux-gnu/gcc-4.1.2:
!!! In gcc_do_make at line 3525
!!! emake failed with all

!!! Call stack:
!!!    * gcc_do_make
(/var/tmp/paludis/cross-x86_64-pc-linux-gnu/gcc-4.1.2/temp/loadsaveenv:3525)
!!!    * gcc_src_compile
(/var/tmp/paludis/cross-x86_64-pc-linux-gnu/gcc-4.1.2/temp/loadsaveenv:3695)
!!!    * toolchain_src_compile
(/var/tmp/paludis/cross-x86_64-pc-linux-gnu/gcc-4.1.2/temp/loadsaveenv:5980)
!!!    * src_compile
(/var/tmp/paludis/cross-x86_64-pc-linux-gnu/gcc-4.1.2/temp/loadsaveenv:5517)
!!!    * ebuild_f_compile (/usr/libexec/paludis/src_compile.bash:51)
!!!    * ebuild_main (/usr/libexec/paludis/ebuild.bash:363)
!!!    * main (/usr/libexec/paludis/ebuild.bash:381)

die trap: exiting with error.

Install error:
  * In main program:
  * When executing stage builder task:
  * When building stage 'cross-minimal-gcc stage':
  * When executing MinimalStage:
  * When performing install action from command line:
  * When executing install task:
  * When installing 'cross-x86_64-pc-linux-gnu/gcc-4.1.2':
  * Install error: Install failed for
'cross-x86_64-pc-linux-gnu/gcc-4.1.2::cross-toolchains'

Build of stage 'cross-minimal-gcc stage' failed:
Error: Failed building stage 'cross-minimal-gcc stage'


Unhandled exception:
  * In main program:
  * When executing stage builder task:
  * When building stage 'cross-minimal-gcc stage':
  * Failed building stage 'cross-minimal-gcc stage'
(paludis::StageBuildError)
###END###



More information about the paludis-user mailing list